Reaction Details
TargetInsulin-like growth factor 1 receptor
LigandBDBM50383181
Substrate/Competitorn/a
Meas. Tech.ChEMBL_819187 (CHEMBL2032456)
Ki 928±n/a nM
Citation Liu, LNorman, MHLee, MXi, NSiegmund, ABoezio, AABooker, SChoquette, DD'Angelo, NDGermain, JYang, KYang, YZhang, YBellon, SFWhittington, DAHarmange, JCDominguez, CKim, TSDussault, I Structure-based design of novel class II c-Met inhibitors: 2. SAR and kinase selectivity profiles of the pyrazolone series. J Med Chem55:1868-97 (2012) 
 
Insulin-like growth factor 1 receptor
Name:Insulin-like growth factor 1 receptor
Type:Protein
Mol. Mass.:154776.79
Organism:Homo sapiens (Human)
Description:P08069
Residue:1367
BDBM50383181
NameBDBM50383181
Synonyms:CHEMBL2031903
TypeSmall organic molecule
Emp. Form.C28H24FN5O4
Mol. Mass.513.5197
SMILESCOc1ccc2c(Oc3ccc(NC(=O)c4c(CN)n(C)n(-c5ccccc5)c4=O)cc3F)ccnc2c1