Reaction Details
TargetVascular endothelial growth factor receptor 2
LigandBDBM50383197
Substrate/Competitorn/a
Meas. Tech.ChEMBL_819185 (CHEMBL2032454)
Ki 246±n/a nM
Citation Liu, LNorman, MHLee, MXi, NSiegmund, ABoezio, AABooker, SChoquette, DD'Angelo, NDGermain, JYang, KYang, YZhang, YBellon, SFWhittington, DAHarmange, JCDominguez, CKim, TSDussault, I Structure-based design of novel class II c-Met inhibitors: 2. SAR and kinase selectivity profiles of the pyrazolone series. J Med Chem55:1868-97 (2012) 
 
Vascular endothelial growth factor receptor 2
Name:Vascular endothelial growth factor receptor 2
Type:Receptor Tyrosine Kinase
Mol. Mass.:151510.97
Organism:Homo sapiens (Human)
Description:P35968
Residue:1356
BDBM50383197
NameBDBM50383197
Synonyms:CHEMBL2029375
TypeSmall organic molecule
Emp. Form.C31H29FN4O5
Mol. Mass.556.5842
SMILESCC[C@H](O)Cn1c(C)c(C(=O)Nc2ccc(Oc3ccnc4cc(OC)ccc34)c(F)c2)c(=O)n1-c1ccccc1