Reaction Details
TargetVascular endothelial growth factor receptor 2
LigandBDBM50383202
Substrate/Competitorn/a
Meas. Tech.ChEMBL_819185 (CHEMBL2032454)
Ki 74±n/a nM
Citation Liu, LNorman, MHLee, MXi, NSiegmund, ABoezio, AABooker, SChoquette, DD'Angelo, NDGermain, JYang, KYang, YZhang, YBellon, SFWhittington, DAHarmange, JCDominguez, CKim, TSDussault, I Structure-based design of novel class II c-Met inhibitors: 2. SAR and kinase selectivity profiles of the pyrazolone series. J Med Chem55:1868-97 (2012) 
 
Vascular endothelial growth factor receptor 2
Name:Vascular endothelial growth factor receptor 2
Type:Receptor Tyrosine Kinase
Mol. Mass.:151510.97
Organism:Homo sapiens (Human)
Description:P35968
Residue:1356
BDBM50383202
NameBDBM50383202
Synonyms:CHEMBL2032023
TypeSmall organic molecule
Emp. Form.C31H27FN4O4
Mol. Mass.538.5689
SMILESCOc1ccc2c(Oc3ccc(NC(=O)c4c(C)n(CC(C)=C)n(-c5ccccc5)c4=O)cc3F)ccnc2c1