Reaction Details
TargetHepatocyte growth factor receptor
LigandBDBM24461
Substrate/Competitorn/a
Meas. Tech.ChEMBL_819184 (CHEMBL2034704)
Ki 7.9±n/a nM
Citation Liu, LNorman, MHLee, MXi, NSiegmund, ABoezio, AABooker, SChoquette, DD'Angelo, NDGermain, JYang, KYang, YZhang, YBellon, SFWhittington, DAHarmange, JCDominguez, CKim, TSDussault, I Structure-based design of novel class II c-Met inhibitors: 2. SAR and kinase selectivity profiles of the pyrazolone series. J Med Chem55:1868-97 (2012) 
 
Hepatocyte growth factor receptor
Name:Hepatocyte growth factor receptor
Type:Protein
Mol. Mass.:155559.73
Organism:Homo sapiens (Human)
Description:P08581
Residue:1390
BDBM24461
NameBDBM24461
Synonyms:N-{3-fluoro-4-[(7-methoxyquinolin-4-yl)oxy]phenyl}-5-methyl-1-(2-methylpropyl)-3-oxo-2-phenyl-2,3-dihydro-1H-pyrazole-4-carboxamide | Substituted Pyrazolone, 3
TypeSmall organic molecule
Emp. Form.C31H29FN4O4
Mol. Mass.540.5848
SMILESCOc1ccc2c(Oc3ccc(NC(=O)c4c(C)n(CC(C)C)n(-c5ccccc5)c4=O)cc3F)ccnc2c1