Reaction Details
TargetHepatocyte growth factor receptor
LigandBDBM24460
Substrate/Competitorn/a
Meas. Tech.ChEMBL_819184 (CHEMBL2034704)
IC50 49±n/a nM
Citation Liu, LNorman, MHLee, MXi, NSiegmund, ABoezio, AABooker, SChoquette, DD'Angelo, NDGermain, JYang, KYang, YZhang, YBellon, SFWhittington, DAHarmange, JCDominguez, CKim, TSDussault, I Structure-based design of novel class II c-Met inhibitors: 2. SAR and kinase selectivity profiles of the pyrazolone series. J Med Chem55:1868-97 (2012) 
 
Hepatocyte growth factor receptor
Name:Hepatocyte growth factor receptor
Type:Protein
Mol. Mass.:155559.73
Organism:Homo sapiens (Human)
Description:P08581
Residue:1390
BDBM24460
NameBDBM24460
Synonyms:N-{3-fluoro-4-[(7-methoxyquinolin-4-yl)oxy]phenyl}-5-methyl-3-oxo-2-phenyl-1-propyl-2,3-dihydro-1H-pyrazole-4-carboxamide | Substituted Pyrazolone, 2
TypeSmall organic molecule
Emp. Form.C30H27FN4O4
Mol. Mass.526.5582
SMILESCCCn1c(C)c(C(=O)Nc2ccc(Oc3ccnc4cc(OC)ccc34)c(F)c2)c(=O)n1-c1ccccc1