Reaction Details
TargetHepatocyte growth factor receptor
LigandBDBM50383205
Substrate/Competitorn/a
Meas. Tech.ChEMBL_819184 (CHEMBL2034704)
IC50 63±n/a nM
Citation Liu, LNorman, MHLee, MXi, NSiegmund, ABoezio, AABooker, SChoquette, DD'Angelo, NDGermain, JYang, KYang, YZhang, YBellon, SFWhittington, DAHarmange, JCDominguez, CKim, TSDussault, I Structure-based design of novel class II c-Met inhibitors: 2. SAR and kinase selectivity profiles of the pyrazolone series. J Med Chem55:1868-97 (2012) 
 
Hepatocyte growth factor receptor
Name:Hepatocyte growth factor receptor
Type:Protein
Mol. Mass.:155559.73
Organism:Homo sapiens (Human)
Description:P08581
Residue:1390
BDBM50383205
NameBDBM50383205
Synonyms:CHEMBL2032020
TypeSmall organic molecule
Emp. Form.C29H25FN4O4
Mol. Mass.512.5316
SMILESCCn1c(C)c(C(=O)Nc2ccc(Oc3ccnc4cc(OC)ccc34)c(F)c2)c(=O)n1-c1ccccc1