Reaction Details
TargetInsulin-like growth factor 1 receptor
LigandBDBM24466
Substrate/Competitorn/a
Meas. Tech.ChEMBL_819187 (CHEMBL2032456)
IC50 1000±n/a nM
Citation Liu, LNorman, MHLee, MXi, NSiegmund, ABoezio, AABooker, SChoquette, DD'Angelo, NDGermain, JYang, KYang, YZhang, YBellon, SFWhittington, DAHarmange, JCDominguez, CKim, TSDussault, I Structure-based design of novel class II c-Met inhibitors: 2. SAR and kinase selectivity profiles of the pyrazolone series. J Med Chem55:1868-97 (2012) 
 
Insulin-like growth factor 1 receptor
Name:Insulin-like growth factor 1 receptor
Type:Protein
Mol. Mass.:154776.79
Organism:Homo sapiens (Human)
Description:P08069
Residue:1367
BDBM24466
NameBDBM24466
Synonyms:1-(2-hydroxy-2-methylpropyl)-N-{5-[(7-methoxyquinolin-4-yl)oxy]pyridin-2-yl}-5-methyl-3-oxo-2-phenyl-2,3-dihydro-1H-pyrazole-4-carboxamide | Substituted Pyrazolone, 17
TypeSmall organic molecule
Emp. Form.C30H29N5O5
Mol. Mass.539.5818
SMILESCOc1ccc2c(Oc3ccc(NC(=O)c4c(C)n(CC(C)(C)O)n(-c5ccccc5)c4=O)nc3)ccnc2c1