Reaction Details
TargetHepatocyte growth factor receptor
LigandBDBM50383215
Substrate/Competitorn/a
Meas. Tech.ChEMBL_819216 (CHEMBL2032485)
Ki 4.8±n/a nM
Citation Norman, MHLiu, LLee, MXi, NFellows, ID'Angelo, NDDominguez, CRex, KBellon, SFKim, TSDussault, I Structure-based design of novel class II c-Met inhibitors: 1. Identification of pyrazolone-based derivatives. J Med Chem55:1858-67 (2012) 
 
Hepatocyte growth factor receptor
Name:Hepatocyte growth factor receptor
Type:Protein
Mol. Mass.:155559.73
Organism:Homo sapiens (Human)
Description:P08581
Residue:1390
BDBM50383215
NameBDBM50383215
Synonyms:CHEMBL2032039
TypeSmall organic molecule
Emp. Form.C23H15F3N4O2
Mol. Mass.436.386
SMILESCOc1ccc2c(OCc3nnc4ccc(cn34)-c3cc(F)c(F)c(F)c3)ccnc2c1