Reaction Details
TargetPeroxisome proliferator-activated receptor delta
LigandBDBM50383371
Substrate/Competitorn/a
Meas. Tech.ChEMBL_818053 (CHEMBL2033581)
IC50 9.5±n/a nM
Citation Lieber, SScheer, FMeissner, WNaruhn, SAdhikary, TMüller-Brüsselbach, SDiederich, WEMüller, R (Z)-2-(2-bromophenyl)-3-{[4-(1-methyl-piperazine)amino]phenyl}acrylonitrile (DG172): an orally bioavailable PPARß/d-selective ligand with inverse agonistic properties. J Med Chem55:2858-68 (2012) 
 
Peroxisome proliferator-activated receptor delta
Name:Peroxisome proliferator-activated receptor delta
Type:PROTEIN
Mol. Mass.:49719.14
Organism:Mus musculus
Description:ChEMBL_1288931
Residue:440
BDBM50383371
NameBDBM50383371
Synonyms:CHEMBL2030550
TypeSmall organic molecule
Emp. Form.C20H20BrN3
Mol. Mass.382.297
SMILESCN1CCN(CC1)c1ccc(\C=C(/C#N)c2ccccc2Br)cc1