Reaction Details
TargetTyrosine-protein kinase ABL1
LigandBDBM50345739
Substrate/Competitorn/a
Meas. Tech.ChEMBL_818069 (CHEMBL2033711)
Ki 750±n/a nM
Citation Larson, ETOjo, KKMurphy, RCJohnson, SMZhang, ZKim, JELeibly, DJFox, AMReid, MCDale, EJPerera, BGKim, JHewitt, SNHol, WGVerlinde, CLFan, EVan Voorhis, WCMaly, DJMerritt, EA Multiple determinants for selective inhibition of apicomplexan calcium-dependent protein kinase CDPK1. J Med Chem55:2803-10 (2012) 
 
Tyrosine-protein kinase ABL1
Name:Tyrosine-protein kinase ABL1
Type:Enzyme
Mol. Mass.:122897.30
Organism:Homo sapiens (Human)
Description:P00519
Residue:1130
BDBM50345739
NameBDBM50345739
Synonyms:1-isopropyl-3-(6-methoxynaphthalen-2-yl)-1H-pyrazolo[3,4-d]pyrimidin-4-amine CHEMBL2070045 US11247972, Compound 7q | US9765037, Compound 7q
TypeSmall organic molecule
Emp. Form.C19H19N5O
Mol. Mass.333.3871
SMILESCOc1ccc2cc(ccc2c1)-c1nn(C(C)C)c2ncnc(N)c12