Reaction Details
TargetProto-oncogene tyrosine-protein kinase Src
LigandBDBM50383377
Substrate/Competitorn/a
Meas. Tech.ChEMBL_818068 (CHEMBL2033710)
Ki>10000±n/a nM
Citation Larson, ETOjo, KKMurphy, RCJohnson, SMZhang, ZKim, JELeibly, DJFox, AMReid, MCDale, EJPerera, BGKim, JHewitt, SNHol, WGVerlinde, CLFan, EVan Voorhis, WCMaly, DJMerritt, EA Multiple determinants for selective inhibition of apicomplexan calcium-dependent protein kinase CDPK1. J Med Chem55:2803-10 (2012) 
 
Proto-oncogene tyrosine-protein kinase Src
Name:Proto-oncogene tyrosine-protein kinase Src
Type:Protein
Mol. Mass.:59838.60
Organism:Homo sapiens (Human)
Description:P12931
Residue:536
BDBM50383377
NameBDBM50383377
Synonyms:CHEMBL2030560 US9765037, Compound 92
TypeSmall organic molecule
Emp. Form.C14H11N3O
Mol. Mass.237.2566
SMILESNc1nc2ccc(cc2[nH]1)C(=O)c1ccccc1