Reaction Details
TargetBotulinum neurotoxin type A
LigandBDBM23274
Substrate/Competitorn/a
Meas. Tech.ChEMBL_818727 (CHEMBL2033254)
IC50 670±n/a nM
Citation Smith, GRCaglic, DCapek, PZhang, YGodbole, SReitz, ABDickerson, TJ Reexamining hydroxamate inhibitors of botulinum neurotoxin serotype A: extending towards theß-exosite. Bioorg Med Chem Lett22:3754-7 (2012) 
 
Botulinum neurotoxin type A
Name:Botulinum neurotoxin type A
Type:PROTEIN
Mol. Mass.:149450.01
Organism:Clostridium botulinum
Description:ChEMBL_1510137
Residue:1296
BDBM23274
NameBDBM23274
Synonyms:(2E)-3-(2,4-dichlorophenyl)-N-hydroxyprop-2-enamide BMCL176463 Compound 2 | Cinnamic hydroxamate deriv., 18
TypeSmall organic molecule
Emp. Form.C9H7Cl2NO2
Mol. Mass.232.063
SMILESONC(=O)\C=C\c1ccc(Cl)cc1Cl