Reaction Details
TargetBotulinum neurotoxin type A
LigandBDBM50383531
Substrate/Competitorn/a
Meas. Tech.ChEMBL_818727 (CHEMBL2033254)
IC50 980±n/a nM
Citation Smith, GRCaglic, DCapek, PZhang, YGodbole, SReitz, ABDickerson, TJ Reexamining hydroxamate inhibitors of botulinum neurotoxin serotype A: extending towards theß-exosite. Bioorg Med Chem Lett22:3754-7 (2012) 
 
Botulinum neurotoxin type A
Name:Botulinum neurotoxin type A
Type:PROTEIN
Mol. Mass.:149450.01
Organism:Clostridium botulinum
Description:ChEMBL_1510137
Residue:1296
BDBM50383531
NameBDBM50383531
Synonyms:CHEMBL2032248
TypeSmall organic molecule
Emp. Form.C15H10ClF2NO2
Mol. Mass.309.695
SMILESONC(=O)\C=C\c1ccc(cc1Cl)-c1ccc(F)cc1F