Reaction Details
TargetKappa-type opioid receptor
LigandBDBM50384053
Substrate/Competitorn/a
Meas. Tech.ChEMBL_819786 (CHEMBL2034298)
EC50 0.1±n/a nM
Citation Roberts, LRBrady, KBrown, ADavey, DFeng, LHuang, HLiu, DMalet, LMcMurray, GPhelan, ASaunders, KBhat, A Kappa agonist CovX-Bodies. Bioorg Med Chem Lett22:4173-8 (2012) 
 
Kappa-type opioid receptor
Name:Kappa-type opioid receptor
Type:G Protein-Coupled Receptor (GPCR)
Mol. Mass.:42744.99
Organism:Cavia porcellus (domestic guinea pig)
Description:P41144
Residue:380
BDBM50384053
NameBDBM50384053
Synonyms:CHEMBL2032453
TypeSmall organic molecule
Emp. Form.C66H86N14O12
Mol. Mass.1267.4756
SMILESCC(C)C[C@@H](NC(=O)[C@@H](Cc1ccccc1)NC(=O)[C@H](N)Cc1ccccc1)C(=O)N[C@H](CCCCN)C(=O)N1CCC(CC1)C(=O)NCCOCCOCC(=O)NCC(=O)NCc1cn(nn1)-c1ccc(cc1)C(=O)Nc1ccc(CCC(=O)N2CCC2=O)cc1