Reaction Details
TargetKappa-type opioid receptor
LigandBDBM50384055
Substrate/Competitorn/a
Meas. Tech.ChEMBL_819785 (CHEMBL2034297)
EC50 3±n/a nM
Citation Roberts, LRBrady, KBrown, ADavey, DFeng, LHuang, HLiu, DMalet, LMcMurray, GPhelan, ASaunders, KBhat, A Kappa agonist CovX-Bodies. Bioorg Med Chem Lett22:4173-8 (2012) 
 
Kappa-type opioid receptor
Name:Kappa-type opioid receptor
Type:G Protein-Coupled Receptor (GPCR)
Mol. Mass.:42648.76
Organism:Homo sapiens (Human)
Description:P41145
Residue:380
BDBM50384055
NameBDBM50384055
Synonyms:CHEMBL2032448
TypeSmall organic molecule
Emp. Form.C50H65N9O9S
Mol. Mass.968.171
SMILESCC(C)C[C@@H](NC(=O)[C@@H](Cc1ccccc1)NC(=O)[C@H](N)Cc1ccccc1)C(=O)N[C@H](CCCCN)C(=O)NCC(=O)NCCSc1cc(O)n(c1O)-c1ccc(CCC(=O)N2CCC2=O)cc1