Reaction Details
TargetKappa-type opioid receptor
LigandBDBM50384057
Substrate/Competitorn/a
Meas. Tech.ChEMBL_819785 (CHEMBL2034297)
EC50 1480±n/a nM
Citation Roberts, LRBrady, KBrown, ADavey, DFeng, LHuang, HLiu, DMalet, LMcMurray, GPhelan, ASaunders, KBhat, A Kappa agonist CovX-Bodies. Bioorg Med Chem Lett22:4173-8 (2012) 
 
Kappa-type opioid receptor
Name:Kappa-type opioid receptor
Type:G Protein-Coupled Receptor (GPCR)
Mol. Mass.:42648.76
Organism:Homo sapiens (Human)
Description:P41145
Residue:380
BDBM50384057
NameBDBM50384057
Synonyms:CHEMBL2032450
TypeSmall organic molecule
Emp. Form.C60H83N11O13S
Mol. Mass.1198.432
SMILESCC(C)C[C@@H](NC(=O)[C@@H](Cc1ccccc1)NC(=O)[C@H](N)Cc1ccccc1)C(=O)N[C@H](CCCCN)C(=O)NCC(=O)NCCSC1CC(=O)N(CCC(=O)NCCOCCOCCC(=O)Nc2ccc(CCC(=O)N3CCC3=O)cc2)C1=O