Reaction Details
TargetcGMP-specific 3',5'-cyclic phosphodiesterase
LigandBDBM50384240
Substrate/Competitorn/a
Meas. Tech.ChEMBL_820074 (CHEMBL2032847)
IC50 1800±n/a nM
Citation Nam, KYChoi, NSHan, CKAhn, SK Identification of chalcones as potent and selective PDE5A1 inhibitors. Bioorg Med Chem Lett22:3983-7 (2012) 
 
cGMP-specific 3',5'-cyclic phosphodiesterase
Name:cGMP-specific 3',5'-cyclic phosphodiesterase
Type:PROTEIN
Mol. Mass.:98615.45
Organism:Bos taurus
Description:ChEMBL_155186
Residue:865
BDBM50384240
NameBDBM50384240
Synonyms:CHEMBL2030202
TypeSmall organic molecule
Emp. Form.C20H22O6
Mol. Mass.358.3851
SMILESCOc1ccc(C(=O)\C=C\c2cc(OC)c(OC)cc2OC)c(OC)c1