Reaction Details
TargetcGMP-specific 3',5'-cyclic phosphodiesterase
LigandBDBM50384241
Substrate/Competitorn/a
Meas. Tech.ChEMBL_820074 (CHEMBL2032847)
IC50 6000±n/a nM
Citation Nam, KYChoi, NSHan, CKAhn, SK Identification of chalcones as potent and selective PDE5A1 inhibitors. Bioorg Med Chem Lett22:3983-7 (2012) 
 
cGMP-specific 3',5'-cyclic phosphodiesterase
Name:cGMP-specific 3',5'-cyclic phosphodiesterase
Type:PROTEIN
Mol. Mass.:98615.45
Organism:Bos taurus
Description:ChEMBL_155186
Residue:865
BDBM50384241
NameBDBM50384241
Synonyms:CHEMBL2030203
TypeSmall organic molecule
Emp. Form.C19H20O5
Mol. Mass.328.3591
SMILESCOc1ccc(C(=O)\C=C\c2cc(OC)ccc2OC)c(OC)c1