Reaction Details
TargetcGMP-specific 3',5'-cyclic phosphodiesterase
LigandBDBM50384242
Substrate/Competitorn/a
Meas. Tech.ChEMBL_820074 (CHEMBL2032847)
IC50 5900±n/a nM
Citation Nam, KYChoi, NSHan, CKAhn, SK Identification of chalcones as potent and selective PDE5A1 inhibitors. Bioorg Med Chem Lett22:3983-7 (2012) 
 
cGMP-specific 3',5'-cyclic phosphodiesterase
Name:cGMP-specific 3',5'-cyclic phosphodiesterase
Type:PROTEIN
Mol. Mass.:98615.45
Organism:Bos taurus
Description:ChEMBL_155186
Residue:865
BDBM50384242
NameBDBM50384242
Synonyms:CHEMBL2030209
TypeSmall organic molecule
Emp. Form.C27H28O7
Mol. Mass.464.507
SMILESCOc1ccc(\C=C\C(=O)c2c(OCc3ccccc3)cc(OC)c(OC)c2OC)cc1OC