Reaction Details
TargetcGMP-specific 3',5'-cyclic phosphodiesterase
LigandBDBM50384243
Substrate/Competitorn/a
Meas. Tech.ChEMBL_820074 (CHEMBL2032847)
IC50 7000±n/a nM
Citation Nam, KYChoi, NSHan, CKAhn, SK Identification of chalcones as potent and selective PDE5A1 inhibitors. Bioorg Med Chem Lett22:3983-7 (2012) 
 
cGMP-specific 3',5'-cyclic phosphodiesterase
Name:cGMP-specific 3',5'-cyclic phosphodiesterase
Type:PROTEIN
Mol. Mass.:98615.45
Organism:Bos taurus
Description:ChEMBL_155186
Residue:865
BDBM50384243
NameBDBM50384243
Synonyms:CHEMBL2030210
TypeSmall organic molecule
Emp. Form.C19H20O5
Mol. Mass.328.3591
SMILESCOc1ccc(OC)c(c1)C(=O)\C=C\c1ccc(OC)c(OC)c1