Reaction Details
TargetcGMP-specific 3',5'-cyclic phosphodiesterase
LigandBDBM14361
Substrate/Competitorn/a
Meas. Tech.ChEMBL_820074 (CHEMBL2032847)
IC50>10000±n/a nM
Citation Nam, KYChoi, NSHan, CKAhn, SK Identification of chalcones as potent and selective PDE5A1 inhibitors. Bioorg Med Chem Lett22:3983-7 (2012) 
 
cGMP-specific 3',5'-cyclic phosphodiesterase
Name:cGMP-specific 3',5'-cyclic phosphodiesterase
Type:PROTEIN
Mol. Mass.:98615.45
Organism:Bos taurus
Description:ChEMBL_155186
Residue:865
BDBM14361
NameBDBM14361
Synonyms:(R,S)-Rolipram 4-[3-(cyclopentyloxy)-4-methoxyphenyl]pyrrolidin-2-one CHEMBL63 | Rolipram
TypeSmall organic molecule
Emp. Form.C16H21NO3
Mol. Mass.275.3428
SMILESCOc1ccc(cc1OC1CCCC1)C1CNC(=O)C1