Reaction Details
TargetHistamine H3 receptor
LigandBDBM50384400
Substrate/Competitorn/a
Meas. Tech.ChEMBL_818345 (CHEMBL2034482)
Ki 4.3±n/a nM
Citation Josef, KAAimone, LDLyons, JRaddatz, RHudkins, RL Synthesis of constrained benzocinnolinone analogues of CEP-26401 (irdabisant) as potent, selective histamine H3 receptor inverse agonists. Bioorg Med Chem Lett22:4198-202 (2012) 
 
Histamine H3 receptor
Name:Histamine H3 receptor
Type:G Protein-Coupled Receptor (GPCR)
Mol. Mass.:48691.47
Organism:Homo sapiens (Human)
Description:Binding assays were using CHO cells stably expressing hH3R receptors.
Residue:445
BDBM50384400
NameBDBM50384400
Synonyms:CHEMBL2031474
TypeSmall organic molecule
Emp. Form.C20H25N3O2
Mol. Mass.339.4314
SMILESC[C@@H]1CCCN1CCCOc1ccc-2c(CCc3cc(=O)[nH]nc-23)c1