Reaction Details
TargetOrexin receptor type 2
LigandBDBM50384412
Substrate/Competitorn/a
Meas. Tech.ChEMBL_818373 (CHEMBL2034510)
IC50 8±n/a nM
Citation Jiang, RSong, XBali, PSmith, ABayona, CRLin, LCameron, MDMcDonald, PHKenny, PJKamenecka, TM Disubstituted piperidines as potent orexin (hypocretin) receptor antagonists. Bioorg Med Chem Lett22:3890-4 (2012) 
 
Orexin receptor type 2
Name:Orexin receptor type 2
Type:Protein
Mol. Mass.:50710.53
Organism:Homo sapiens (Human)
Description:O43614
Residue:444
BDBM50384412
NameBDBM50384412
Synonyms:CHEMBL2031504
TypeSmall organic molecule
Emp. Form.C27H26FN3O3S
Mol. Mass.491.577
SMILESC[C@H]1CCC[C@@H](CNC(=O)c2cccc3occc23)N1C(=O)c1nc(C)sc1-c1ccc(F)cc1