Reaction Details
TargetOrexin receptor type 2
LigandBDBM50384408
Substrate/Competitorn/a
Meas. Tech.ChEMBL_818373 (CHEMBL2034510)
IC50 2±n/a nM
Citation Jiang, RSong, XBali, PSmith, ABayona, CRLin, LCameron, MDMcDonald, PHKenny, PJKamenecka, TM Disubstituted piperidines as potent orexin (hypocretin) receptor antagonists. Bioorg Med Chem Lett22:3890-4 (2012) 
 
Orexin receptor type 2
Name:Orexin receptor type 2
Type:Protein
Mol. Mass.:50710.53
Organism:Homo sapiens (Human)
Description:O43614
Residue:444
BDBM50384408
NameBDBM50384408
Synonyms:CHEMBL2031498
TypeSmall organic molecule
Emp. Form.C29H25F2N3O2
Mol. Mass.485.5245
SMILESFC1(F)CC[C@@H](CNC(=O)c2cccc3cccnc23)N(C1)C(=O)c1ccccc1-c1ccccc1