Reaction Details
TargetProtein-S-isoprenylcysteine O-methyltransferase
LigandBDBM50034278
Substrate/Competitorn/a
Meas. Tech.ChEMBL_821764 (CHEMBL2039061)
IC50 25500±n/a nM
Citation Bergman, JAHahne, KSong, JHrycyna, CAGibbs, RA S-Farnesyl-Thiopropionic Acid (FTPA) Triazoles as Potent Inhibitors of Isoprenylcysteine Carboxyl Methyltransferase. ACS Med Chem Lett3:15-19 (2012) 
 
Protein-S-isoprenylcysteine O-methyltransferase
Name:Protein-S-isoprenylcysteine O-methyltransferase
Type:PROTEIN
Mol. Mass.:31943.26
Organism:Homo sapiens (Human)
Description:ChEMBL_956034
Residue:284
BDBM50034278
NameBDBM50034278
Synonyms:2-((2E,6E)-3,7,11-Trimethyl-dodeca-2,6,10-trienylsulfanyl)-benzoic acid Farnesylthiosalicyclic acid S-trans,trans-farnesylthiosalicylic acid
TypeSmall organic molecule
Emp. Form.C22H30O2S
Mol. Mass.358.537
SMILES[#6]\[#6](-[#6])=[#6]\[#6]-[#6]\[#6](-[#6])=[#6]\[#6]-[#6]\[#6](-[#6])=[#6]\[#6]-[#16]-c1ccccc1-[#6](-[#8])=O