Reaction Details
TargetRegulator of G-protein signaling 8
LigandBDBM50384747
Substrate/Competitorn/a
Meas. Tech.ChEMBL_821036 (CHEMBL2039223)
IC50 13200±n/a nM
Citation Turner, EMBlazer, LLNeubig, RRHusbands, SM Small Molecule Inhibitors of Regulator of G Protein Signalling (RGS) Proteins. ACS Med Chem Lett3:146-150 (2012) 
 
Regulator of G-protein signaling 8
Name:Regulator of G-protein signaling 8
Type:Enzyme Catalytic Domain
Mol. Mass.:20925.80
Organism:Homo sapiens (Human)
Description:gi_74355113
Residue:180
BDBM50384747
NameBDBM50384747
Synonyms:CHEMBL2037346
TypeSmall organic molecule
Emp. Form.C15H10Cl2N2O2S
Mol. Mass.353.223
SMILESClc1ccc(cc1Cl)-n1sc(=O)n(Cc2ccccc2)c1=O