Reaction Details
TargetRegulator of G-protein signaling 4
LigandBDBM50384757
Substrate/Competitorn/a
Meas. Tech.ChEMBL_821035 (CHEMBL2039222)
IC50 15±n/a nM
Citation Turner, EMBlazer, LLNeubig, RRHusbands, SM Small Molecule Inhibitors of Regulator of G Protein Signalling (RGS) Proteins. ACS Med Chem Lett3:146-150 (2012) 
 
Regulator of G-protein signaling 4
Name:Regulator of G-protein signaling 4
Type:Enzyme
Mol. Mass.:23263.51
Organism:Homo sapiens (Human)
Description:P49798
Residue:205
BDBM50384757
NameBDBM50384757
Synonyms:CHEMBL2037354
TypeSmall organic molecule
Emp. Form.C17H16N2O2S
Mol. Mass.312.386
SMILESCc1ccc(cc1)-n1sc(=O)n(Cc2cccc(C)c2)c1=O