Reaction Details
TargetRegulator of G-protein signaling 8
LigandBDBM50384774
Substrate/Competitorn/a
Meas. Tech.ChEMBL_821036 (CHEMBL2039223)
IC50 11000±n/a nM
Citation Turner, EMBlazer, LLNeubig, RRHusbands, SM Small Molecule Inhibitors of Regulator of G Protein Signalling (RGS) Proteins. ACS Med Chem Lett3:146-150 (2012) 
 
Regulator of G-protein signaling 8
Name:Regulator of G-protein signaling 8
Type:Enzyme Catalytic Domain
Mol. Mass.:20925.80
Organism:Homo sapiens (Human)
Description:gi_74355113
Residue:180
BDBM50384774
NameBDBM50384774
Synonyms:CHEMBL1917204 | US20230414581, Compound 6
TypeSmall organic molecule
Emp. Form.C16H13FN2O2S
Mol. Mass.316.35
SMILESCc1ccc(cc1)-n1sc(=O)n(Cc2ccc(F)cc2)c1=O