Reaction Details
TargetRegulator of G-protein signaling 8
LigandBDBM50384775
Substrate/Competitorn/a
Meas. Tech.ChEMBL_821036 (CHEMBL2039223)
IC50 6200±n/a nM
Citation Turner, EMBlazer, LLNeubig, RRHusbands, SM Small Molecule Inhibitors of Regulator of G Protein Signalling (RGS) Proteins. ACS Med Chem Lett3:146-150 (2012) 
 
Regulator of G-protein signaling 8
Name:Regulator of G-protein signaling 8
Type:Enzyme Catalytic Domain
Mol. Mass.:20925.80
Organism:Homo sapiens (Human)
Description:gi_74355113
Residue:180
BDBM50384775
NameBDBM50384775
Synonyms:CHEMBL2037227
TypeSmall organic molecule
Emp. Form.C15H11FN2O2S
Mol. Mass.302.323
SMILESFc1ccc(Cn2c(=O)sn(-c3ccccc3)c2=O)cc1