Reaction Details
TargetRegulator of G-protein signaling 8
LigandBDBM50384761
Substrate/Competitorn/a
Meas. Tech.ChEMBL_821036 (CHEMBL2039223)
IC50 8400±n/a nM
Citation Turner, EMBlazer, LLNeubig, RRHusbands, SM Small Molecule Inhibitors of Regulator of G Protein Signalling (RGS) Proteins. ACS Med Chem Lett3:146-150 (2012) 
 
Regulator of G-protein signaling 8
Name:Regulator of G-protein signaling 8
Type:Enzyme Catalytic Domain
Mol. Mass.:20925.80
Organism:Homo sapiens (Human)
Description:gi_74355113
Residue:180
BDBM50384761
NameBDBM50384761
Synonyms:CHEMBL2037358
TypeSmall organic molecule
Emp. Form.C10H10N2O2S
Mol. Mass.222.264
SMILESCc1ccc(cc1)-n1sc(=O)n(C)c1=O