Reaction Details
TargetTaste receptor type 2 member 31
LigandBDBM50312648
Substrate/Competitorn/a
Meas. Tech.ChEMBL_821056 (CHEMBL2039382)
IC50 3600±n/a nM
Citation Kinghorn, ADPan, LFletcher, JNChai, H The relevance of higher plants in lead compound discovery programs. J Nat Prod74:1539-55 (2011) 
 
Taste receptor type 2 member 31
Name:Taste receptor type 2 member 31
Type:PROTEIN
Mol. Mass.:35304.19
Organism:Homo sapiens (Human)
Description:ChEMBL_1454723
Residue:309
BDBM50312648
NameBDBM50312648
Synonyms:(2S)-5-hydroxy-2-(4-hydroxyphenyl)-7-methoxy-2,3-dihydro-4H-chromen-4-one 5,4'-dihydroxy-7-methoxyflavanone CHEMBL448297 | Sakuranetin
TypeSmall organic molecule
Emp. Form.C16H14O5
Mol. Mass.286.2794
SMILESCOc1cc(O)c2C(=O)C[C@H](Oc2c1)c1ccc(O)cc1