Reaction Details
TargetGlycogen synthase kinase-3 beta
LigandBDBM50229962
Substrate/Competitorn/a
Meas. Tech.ChEMBL_821140 (CHEMBL2039682)
IC50 104±n/a nM
Citation Palomo, VSoteras, IPerez, DIPerez, CGil, CCampillo, NEMartinez, A Exploring the binding sites of glycogen synthase kinase 3. Identification and characterization of allosteric modulation cavities. J Med Chem54:8461-70 (2011) 
 
Glycogen synthase kinase-3 beta
Name:Glycogen synthase kinase-3 beta
Type:Enzyme
Mol. Mass.:46756.38
Organism:Homo sapiens (Human)
Description:P49841
Residue:420
BDBM50229962
NameBDBM50229962
Synonyms:1-(4-methoxybenzyl)-3-(5-nitrothiazol-2-yl)urea CHEMBL259850 | N-(4-METHOXYBENZYL)-N'-(5-NITRO-1,3-THIAZOL-2-YL)UREA
TypeSmall organic molecule
Emp. Form.C12H12N4O4S
Mol. Mass.308.313
SMILESCOc1ccc(CNC(=O)Nc2ncc(s2)[N+]([O-])=O)cc1