Reaction Details
TargetProstaglandin G/H synthase 2
LigandBDBM85511
Substrate/Competitorn/a
Meas. Tech.ChEMBL_821148 (CHEMBL2039690)
IC50 60500±n/a nM
Citation Viegas, AManso, JCorvo, MCMarques, MMCabrita, EJ Binding of ibuprofen, ketorolac, and diclofenac to COX-1 and COX-2 studied by saturation transfer difference NMR. J Med Chem54:8555-62 (2011) 
 
Prostaglandin G/H synthase 2
Name:Prostaglandin G/H synthase 2
Type:Enzyme
Mol. Mass.:69003.89
Organism:Homo sapiens (Human)
Description:Recombinant Cox-2 provided by Cayman (Cayman Chemical Co.,Ann Arbor, MI).
Residue:604
BDBM85511
NameBDBM85511
Synonyms:CAS_74103-07-4 Ketorolac tris salt | Toradol
TypeSmall organic molecule
Emp. Form.C15H13NO3
Mol. Mass.255.2686
SMILESOC(=O)C1CCn2c1ccc2C(=O)c1ccccc1