Reaction Details
TargetGlycylpeptide N-tetradecanoyltransferase 2
LigandBDBM50384916
Substrate/Competitorn/a
Meas. Tech.ChEMBL_820573 (CHEMBL2040310)
Ki 41530±n/a nM
Citation Goncalves, VBrannigan, JAWhalley, DAnsell, KHSaxty, BHolder, AAWilkinson, AJTate, EWLeatherbarrow, RJ Discovery of Plasmodium vivax N-myristoyltransferase inhibitors: screening, synthesis, and structural characterization of their binding mode. J Med Chem55:3578-82 (2012) 
 
Glycylpeptide N-tetradecanoyltransferase 2
Name:Glycylpeptide N-tetradecanoyltransferase 2
Type:PROTEIN
Mol. Mass.:56986.61
Organism:Homo sapiens (Human)
Description:ChEMBL_1435042
Residue:498
BDBM50384916
NameBDBM50384916
Synonyms:CHEMBL2036504
TypeSmall organic molecule
Emp. Form.C16H16N2O2S
Mol. Mass.300.375
SMILESCCOC(=O)c1c(C)nc2ccccc2c1SCCC#N