Reaction Details
TargetGlycylpeptide N-tetradecanoyltransferase 2
LigandBDBM33749
Substrate/Competitorn/a
Meas. Tech.ChEMBL_820573 (CHEMBL2040310)
Ki>100000±n/a nM
Citation Goncalves, VBrannigan, JAWhalley, DAnsell, KHSaxty, BHolder, AAWilkinson, AJTate, EWLeatherbarrow, RJ Discovery of Plasmodium vivax N-myristoyltransferase inhibitors: screening, synthesis, and structural characterization of their binding mode. J Med Chem55:3578-82 (2012) 
 
Glycylpeptide N-tetradecanoyltransferase 2
Name:Glycylpeptide N-tetradecanoyltransferase 2
Type:PROTEIN
Mol. Mass.:56986.61
Organism:Homo sapiens (Human)
Description:ChEMBL_1435042
Residue:498
BDBM33749
NameBDBM33749
Synonyms:3-(6-Bromo-3-butyl-2-methyl-quinolin-4-ylsulfanyl)-propionitrile 3-(6-bromo-3-butyl-2-methylquinolin-4-yl)sulfanylpropanenitrile 3-[(6-bromo-3-butyl-2-methyl-4-quinolyl)thio]propionitrile SMR000218761 | cid_1880613
TypeSmall organic molecule
Emp. Form.C17H19BrN2S
Mol. Mass.363.315
SMILESCCCCc1c(C)nc2ccc(Br)cc2c1SCCC#N