Reaction Details
TargetHistamine H3 receptor
LigandBDBM50384944
Substrate/Competitorn/a
Meas. Tech.ChEMBL_820600 (CHEMBL2040489)
Ki 3±n/a nM
Citation Zulli, ALAimone, LDMathiasen, JRGruner, JARaddatz, RBacon, ERHudkins, RL Substituted phenoxypropyl-(R)-2-methylpyrrolidine aminomethyl ketones as histamine-3 receptor inverse agonists. Bioorg Med Chem Lett22:2807-10 (2012) 
 
Histamine H3 receptor
Name:Histamine H3 receptor
Type:G Protein-Coupled Receptor (GPCR)
Mol. Mass.:48691.47
Organism:Homo sapiens (Human)
Description:Binding assays were using CHO cells stably expressing hH3R receptors.
Residue:445
BDBM50384944
NameBDBM50384944
Synonyms:CHEMBL2036657
TypeSmall organic molecule
Emp. Form.C27H34FN3O4
Mol. Mass.483.575
SMILESC[C@@H]1CCCN1CCCOc1ccc(cc1)C(=O)CN1CCN(CC1)C(=O)Oc1ccc(F)cc1