Reaction Details
TargetD(1B) dopamine receptor
LigandBDBM50384945
Substrate/Competitorn/a
Meas. Tech.ChEMBL_821614 (CHEMBL2038569)
Ki>10000±n/a nM
Citation Li, JFronczek, FRFerreira, DBurandt, CLSetola, VRoth, BLZjawiony, JK Bis-spirolabdane diterpenoids from Leonotis nepetaefolia. J Nat Prod75:728-34 (2012) 
 
D(1B) dopamine receptor
Name:D(1B) dopamine receptor
Type:Protein
Mol. Mass.:52943.41
Organism:Homo sapiens (Human)
Description:P21918
Residue:477
BDBM50384945
NameBDBM50384945
Synonyms:CHEMBL2036989
TypeSmall organic molecule
Emp. Form.C20H26O5
Mol. Mass.346.4174
SMILESC[C@]12CCC[C@@]3(C)[C@H]1[C@@H](C[C@@]1(CO1)[C@]3(O)CCc1ccoc1)OC2=O