Reaction Details
TargetProtein kinase C theta type
LigandBDBM50384998
Substrate/Competitorn/a
Meas. Tech.ChEMBL_821088 (CHEMBL2039491)
IC50>100000±n/a nM
Citation Lauro, GMasullo, MPiacente, SRiccio, RBifulco, G Inverse Virtual Screening allows the discovery of the biological activity of natural compounds. Bioorg Med Chem20:3596-602 (2012) 
 
Protein kinase C theta type
Name:Protein kinase C theta type
Type:Serine/threonine-protein kinase
Mol. Mass.:81878.04
Organism:Homo sapiens (Human)
Description:Full-length human PKC theta (Panvera Catalog No. P2996).
Residue:706
BDBM50384998
NameBDBM50384998
Synonyms:CVD-0019905 | XANTHOHUMOL
TypeSmall organic molecule
Emp. Form.C21H22O5
Mol. Mass.354.3964
SMILES[#6]-[#8]-c1cc(-[#8])c(-[#6]\[#6]=[#6](/[#6])-[#6])c(-[#8])c1-[#6](=O)\[#6]=[#6]\c1ccc(-[#8])cc1