Reaction Details
TargetThyroid hormone receptor beta
LigandBDBM50385106
Substrate/Competitorn/a
Meas. Tech.ChEMBL_821529 (CHEMBL2038197)
Ki 10±n/a nM
Citation Shiohara, HNakamura, TKikuchi, NOzawa, TNagano, RMatsuzawa, AOhnota, HMiyamoto, TIchikawa, KHashizume, K Discovery of novel indane derivatives as liver-selective thyroid hormone receptorß (TRß) agonists for the treatment of dyslipidemia. Bioorg Med Chem20:3622-34 (2012) 
 
Thyroid hormone receptor beta
Name:Thyroid hormone receptor beta
Type:Receptor
Mol. Mass.:52793.62
Organism:Homo sapiens (Human)
Description:Recombinant hThR was obtained from nuclear extracts from SF9 cells infected with baculovirus vectors encoding for ThRbeta 1.
Residue:461
BDBM50385106
NameBDBM50385106
Synonyms:CHEMBL2035875
TypeSmall organic molecule
Emp. Form.C20H23NO5
Mol. Mass.357.4003
SMILESCC(C)c1cc(Oc2c(C)cc(NC(=O)CC(O)=O)cc2C)ccc1O