Reaction Details
TargetThyroid hormone receptor alpha
LigandBDBM50385111
Substrate/Competitorn/a
Meas. Tech.ChEMBL_821530 (CHEMBL2038198)
Ki 2.45±n/a nM
Citation Shiohara, HNakamura, TKikuchi, NOzawa, TNagano, RMatsuzawa, AOhnota, HMiyamoto, TIchikawa, KHashizume, K Discovery of novel indane derivatives as liver-selective thyroid hormone receptorß (TRß) agonists for the treatment of dyslipidemia. Bioorg Med Chem20:3622-34 (2012) 
 
Thyroid hormone receptor alpha
Name:Thyroid hormone receptor alpha
Type:Receptor
Mol. Mass.:54818.00
Organism:Homo sapiens (Human)
Description:Recombinant hThR was obtained from nuclear extracts from SF9 cells infected with baculovirus vectors encoding for ThRalpha 1.
Residue:490
BDBM50385111
NameBDBM50385111
Synonyms:CHEMBL2035881
TypeSmall organic molecule
Emp. Form.C21H23NO5
Mol. Mass.369.411
SMILESCC(C)c1cc(Oc2c3CCCc3c(NC(=O)C(O)=O)cc2C)ccc1O