Reaction Details
TargetProstaglandin E2 receptor EP2 subtype
LigandBDBM50366136
Substrate/Competitorn/a
Meas. Tech.ChEMBL_822927 (CHEMBL2038098)
Ki 3±n/a nM
Citation Kambe, TMaruyama, TNakai, YOida, HMaruyama, TAbe, NNishiura, ANakai, HToda, M Synthesis and evaluation of¿-lactam analogs of PGE2 as EP4 and EP2/EP4 agonists. Bioorg Med Chem20:3502-22 (2012) 
 
Prostaglandin E2 receptor EP2 subtype
Name:Prostaglandin E2 receptor EP2 subtype
Type:G-protein coupled receptor
Mol. Mass.:40495.26
Organism:Mus musculus (Mouse)
Description:n/a
Residue:362
BDBM50366136
NameBDBM50366136
Synonyms:CHEMBL1957435
TypeSmall organic molecule
Emp. Form.C26H26N2O4S2
Mol. Mass.494.626
SMILESO[C@@H](Cc1cccc(c1)-c1ccccc1)\C=C\[C@H]1CCC(=O)N1CCSc1nc(cs1)C(O)=O