Reaction Details
TargetProstaglandin E2 receptor EP4 subtype
LigandBDBM50385136
Substrate/Competitorn/a
Meas. Tech.ChEMBL_822929 (CHEMBL2038100)
Ki 0.16±n/a nM
Citation Kambe, TMaruyama, TNakai, YOida, HMaruyama, TAbe, NNishiura, ANakai, HToda, M Synthesis and evaluation of¿-lactam analogs of PGE2 as EP4 and EP2/EP4 agonists. Bioorg Med Chem20:3502-22 (2012) 
 
Prostaglandin E2 receptor EP4 subtype
Name:Prostaglandin E2 receptor EP4 subtype
Type:G-protein coupled receptor
Mol. Mass.:56175.66
Organism:Mus musculus (Mouse)
Description:n/a
Residue:513
BDBM50385136
NameBDBM50385136
Synonyms:CHEMBL2037289
TypeSmall organic molecule
Emp. Form.C28H27N3O5S2
Mol. Mass.549.661
SMILESCc1ccc2nc(oc2c1)-c1cccc(C[C@H](O)\C=C\[C@H]2CCC(=O)N2CCSc2nc(cs2)C(O)=O)c1