Reaction Details
TargetProstaglandin E2 receptor EP2 subtype
LigandBDBM50360626
Substrate/Competitorn/a
Meas. Tech.ChEMBL_822930 (CHEMBL2038101)
EC50 90±n/a nM
Citation Kambe, TMaruyama, TNakai, YOida, HMaruyama, TAbe, NNishiura, ANakai, HToda, M Synthesis and evaluation of¿-lactam analogs of PGE2 as EP4 and EP2/EP4 agonists. Bioorg Med Chem20:3502-22 (2012) 
 
Prostaglandin E2 receptor EP2 subtype
Name:Prostaglandin E2 receptor EP2 subtype
Type:PROTEIN
Mol. Mass.:39786.37
Organism:Rattus norvegicus
Description:ChEMBL_1501400
Residue:357
BDBM50360626
NameBDBM50360626
Synonyms:CHEMBL1933722
TypeSmall organic molecule
Emp. Form.C21H24N2O4S2
Mol. Mass.432.556
SMILESCc1cccc(C[C@H](O)\C=C\[C@H]2CCC(=O)N2CCSc2nc(cs2)C(O)=O)c1