Reaction Details
TargetVascular endothelial growth factor receptor 2
LigandBDBM4814
Substrate/Competitorn/a
Meas. Tech.ChEMBL_822165 (CHEMBL2038025)
IC50 70±n/a nM
Citation Determann, RDreher, JBaumann, KPreu, LJones, PGTotzke, FSchächtele, CKubbutat, MHKunick, C 2-Anilino-4-(benzimidazol-2-yl)pyrimidines--a multikinase inhibitor scaffold with antiproliferative activity toward cancer cell lines. Eur J Med Chem53:254-63 (2012) 
 
Vascular endothelial growth factor receptor 2
Name:Vascular endothelial growth factor receptor 2
Type:Receptor Tyrosine Kinase
Mol. Mass.:151510.97
Organism:Homo sapiens (Human)
Description:P35968
Residue:1356
BDBM4814
NameBDBM4814
Synonyms:CHEMBL535 N-[2-(diethylamino)ethyl]-5-{[(3Z)-5-fluoro-2-oxo-2,3-dihydro-1H-indol-3-ylidene]methyl}-2,4-dimethyl-1H-pyrrole-3-carboxamide SUNITINIB US10464902, Sunitinib US9163010, Sunitinib | US9914707, SU11248
TypeSmall organic molecule
Emp. Form.C22H27FN4O2
Mol. Mass.398.4738
SMILESCCN(CC)CCNC(=O)c1c(C)[nH]c(\C=C2/C(=O)Nc3ccc(F)cc23)c1C