Reaction Details
TargetPeroxisome proliferator-activated receptor alpha
LigandBDBM50181902
Substrate/Competitorn/a
Meas. Tech.ChEMBL_822292 (CHEMBL2038446)
IC50 115.88±n/a nM
Citation Méndez-Lucio, OPérez-Villanueva, JCastillo, RMedina-Franco, JL Activity landscape modeling of PPAR ligands with dual-activity difference maps. Bioorg Med Chem20:3523-32 (2012) 
 
Peroxisome proliferator-activated receptor alpha
Name:Peroxisome proliferator-activated receptor alpha
Type:Enzyme
Mol. Mass.:52222.08
Organism:Homo sapiens (Human)
Description:Q07869
Residue:468
BDBM50181902
NameBDBM50181902
Synonyms:2-(6-(3-(4-(4-fluorobenzoyl)phenoxy)propoxy)-1H-indol-1-yl)acetic acid | CHEMBL201581
TypeSmall organic molecule
Emp. Form.C26H22FNO5
Mol. Mass.447.455
SMILESOC(=O)Cn1ccc2ccc(OCCCOc3ccc(cc3)C(=O)c3ccc(F)cc3)cc12