Reaction Details
TargetPeroxisome proliferator-activated receptor delta
LigandBDBM50181902
Substrate/Competitorn/a
Meas. Tech.ChEMBL_822293 (CHEMBL2038596)
IC50 3155±n/a nM
Citation Méndez-Lucio, OPérez-Villanueva, JCastillo, RMedina-Franco, JL Activity landscape modeling of PPAR ligands with dual-activity difference maps. Bioorg Med Chem20:3523-32 (2012) 
 
Peroxisome proliferator-activated receptor delta
Name:Peroxisome proliferator-activated receptor delta
Type:Enzyme
Mol. Mass.:49910.45
Organism:Homo sapiens (Human)
Description:Q03181
Residue:441
BDBM50181902
NameBDBM50181902
Synonyms:2-(6-(3-(4-(4-fluorobenzoyl)phenoxy)propoxy)-1H-indol-1-yl)acetic acid | CHEMBL201581
TypeSmall organic molecule
Emp. Form.C26H22FNO5
Mol. Mass.447.455
SMILESOC(=O)Cn1ccc2ccc(OCCCOc3ccc(cc3)C(=O)c3ccc(F)cc3)cc12