Reaction Details
TargetPeroxisome proliferator-activated receptor alpha
LigandBDBM50135777
Substrate/Competitorn/a
Meas. Tech.ChEMBL_822292 (CHEMBL2038446)
IC50 15±n/a nM
Citation Méndez-Lucio, OPérez-Villanueva, JCastillo, RMedina-Franco, JL Activity landscape modeling of PPAR ligands with dual-activity difference maps. Bioorg Med Chem20:3523-32 (2012) 
 
Peroxisome proliferator-activated receptor alpha
Name:Peroxisome proliferator-activated receptor alpha
Type:Enzyme
Mol. Mass.:52222.08
Organism:Homo sapiens (Human)
Description:Q07869
Residue:468
BDBM50135777
NameBDBM50135777
Synonyms:2-(4-{3-[1-(4-tert-Butyl-benzyl)-4-methyl-5-oxo-4,5-dihydro-1H-[1,2,4]triazol-3-yl]-propyl}-phenoxy)-2-methyl-propionic acid | CHEMBL148639
TypeSmall organic molecule
Emp. Form.C27H35N3O4
Mol. Mass.465.5845
SMILESCn1c(CCCc2ccc(OC(C)(C)C(O)=O)cc2)nn(Cc2ccc(cc2)C(C)(C)C)c1=O