Reaction Details
TargetHistamine H3 receptor
LigandBDBM50385243
Substrate/Competitorn/a
Meas. Tech.ChEMBL_822385 (CHEMBL2038933)
Ki 4±n/a nM
Citation Becknell, NCLyons, JAAimone, LDHuang, ZGruner, JARaddatz, RHudkins, RL Synthesis and evaluation of 4- and 5-pyridazin-3-one phenoxypropylamine analogues as histamine-3 receptor antagonists. Bioorg Med Chem20:3880-6 (2012) 
 
Histamine H3 receptor
Name:Histamine H3 receptor
Type:G Protein-Coupled Receptor (GPCR)
Mol. Mass.:48691.47
Organism:Homo sapiens (Human)
Description:Binding assays were using CHO cells stably expressing hH3R receptors.
Residue:445
BDBM50385243
NameBDBM50385243
Synonyms:CHEMBL2037608
TypeSmall organic molecule
Emp. Form.C20H27N3O3
Mol. Mass.357.4467
SMILESCOCn1ncc(cc1=O)-c1ccc(OCCCN2CCC[C@H]2C)cc1