Reaction Details
TargetCytochrome P450 2C19
LigandBDBM50385246
Substrate/Competitorn/a
Meas. Tech.ChEMBL_822403 (CHEMBL2038951)
IC50>30000±n/a nM
Citation Becknell, NCLyons, JAAimone, LDHuang, ZGruner, JARaddatz, RHudkins, RL Synthesis and evaluation of 4- and 5-pyridazin-3-one phenoxypropylamine analogues as histamine-3 receptor antagonists. Bioorg Med Chem20:3880-6 (2012) 
 
Cytochrome P450 2C19
Name:Cytochrome P450 2C19
Type:Enzyme
Mol. Mass.:55935.47
Organism:Homo sapiens (Human)
Description:P33261
Residue:490
BDBM50385246
NameBDBM50385246
Synonyms:CHEMBL2037604
TypeSmall organic molecule
Emp. Form.C19H25N3O2
Mol. Mass.327.4207
SMILESC[C@H](COc1ccc(cc1)-c1cn[nH]c(=O)c1)CN1CCC[C@H]1C