Reaction Details
TargetPotassium voltage-gated channel subfamily H member 2
LigandBDBM50350023
Substrate/Competitorn/a
Meas. Tech.ChEMBL_822408 (CHEMBL2038956)
IC50 10000±n/a nM
Citation Becknell, NCLyons, JAAimone, LDHuang, ZGruner, JARaddatz, RHudkins, RL Synthesis and evaluation of 4- and 5-pyridazin-3-one phenoxypropylamine analogues as histamine-3 receptor antagonists. Bioorg Med Chem20:3880-6 (2012) 
 
Potassium voltage-gated channel subfamily H member 2
Name:Potassium voltage-gated channel subfamily H member 2
Type:Multi-pass membrane protein
Mol. Mass.:126672.65
Organism:Homo sapiens (Human)
Description:Q12809
Residue:1159
BDBM50350023
NameBDBM50350023
Synonyms:CHEMBL1813065
TypeSmall organic molecule
Emp. Form.C18H23N3O2
Mol. Mass.313.3941
SMILESC[C@@H]1CCCN1CCCOc1ccc(cc1)-c1cn[nH]c(=O)c1